{"text_format":"2","workbook":"xlsx","n_sheets":17,"sheets":["封面","概况表","一览表","其他费用明细表","移交生产的资产总表","移交资产—配电网资产一览表","移交资产—配电网资产一览表 (2)","设备材料清册","05(资金）","05-1表","04-1","04-2","工作表","Sheet2","移交资产—配电网资产一览表（OLD）","45个项目开竣工时间","项目明细账"],"not_rendered":{"charts":0,"images":0,"macros":0,"external_links":3,"defined_names":27,"comments":1,"pivot_tables":0},"unopened":[],"bounds":{"document_bytes":16777216,"sheet_cells":100000,"run_cost":"one","rows_first":2000,"rows_last":500,"rows_between":2000,"halvings":0,"cell_chars":16384,"cell_head_chars":4096},"cells_cut":0,"cells_raw":0,"read":"whole","date_system":"1900"}

{"sheet":"封面","index":0,"n_rows":20,"n_cols":8,"rows_kept":20,"cut":false,"hidden":false,"merged":[[14,0,14,9],[6,0,6,9],[9,0,9,9],[10,4,10,6],[11,4,11,6],[12,0,12,9]]}
[]
[]
[]
[]
[]
[]
{"$rows_left_out":15}
{"sheet":"概况表","index":1,"n_rows":21,"n_cols":9,"rows_kept":21,"cut":false,"hidden":false,"merged":[[0,0,0,8],[2,3,2,5],[5,1,5,4],[5,6,5,8],[6,1,6,4],[6,6,6,8],[7,0,7,4],[7,5,7,8],[8,2,8,4],[8,5,8,6],[8,7,8,8],[9,2,9,4],[9,5,9,6],[9,7,9,8],[10,2,10,4],[10,5,10,6],[10,7,10,8],[11,2,11,4],[11,5,11,6],[11,7,11,8],[12,2,12,4],[12,5,12,6],[12,7,12,8],[16,7,16,8],[13,2,13,4],[13,5,13,6],[13,7,13,8],[14,2,14,4],[14,5,14,6],[14,7,14,8],[17,5,17,6],[17,7,17,8],[18,5,18,6],[18,7,18,8],[3,0,4,0],[8,0,12,0],[14,0,15,0],[16,0,18,0],[3,5,4,5],[3,1,4,4],[16,1,18,4],[3,6,4,8],[15,2,15,4],[15,5,15,6],[15,7,15,8],[16,5,16,6]]}
["配网工程竣工概况表"]
[{"$nulls":8},"配竣建01表"]
[{"$f":"封面!A13","v":"编制单位："},null,null,{"$f":"封面!A15","v":"编制日期："},{"$nulls":4},"单位：元"]
["工程名称",{"$nulls":4},"设计单位"]
[]
["建设地址",{"$nulls":4},"施工单位"]
{"$rows_left_out":16}
{"sheet":"一览表","index":2,"n_rows":69,"n_cols":15,"rows_kept":69,"cut":false,"hidden":false,"merged":[[3,13,3,14],[66,8,66,9],[3,1,5,1],[3,2,4,2],[0,5,0,9],[2,6,2,8],[3,3,3,7],[3,8,3,12]]}
[{"$nulls":5},"竣 工 工 程 决 算 一 览 表"]
[{"$nulls":14},"配竣建02表"]
[{"$f":"封面!A13","v":"编制单位："},{"$nulls":5},{"$f":"封面!A15","v":"编制日期："},{"$nulls":7},"单位：元"]
["   栏","项目定义编码","工程项目","预    算   价   值",{"$nulls":4},"实     际     价     值",{"$nulls":4},"实际较预算增减"]
["行  次",null,null,"建筑工程","安装工程","设备价值","其他费用","合计","建筑工程","安装工程","设备价值","其他费用","合计","增减额(元)","增减率(%)"]
[" 次",null,1,2,4,5,6,"7=2+4+5+6",8,9,10,11,"12=8+9+10+11","13＝12-7","14＝13/7"]
{"$rows_left_out":25}
{"sheet":"其他费用明细表","index":3,"n_rows":27,"n_cols":5,"rows_kept":27,"cut":false,"hidden":false,"merged":[[3,1,4,1],[3,2,4,2],[3,3,4,3]]}
[null,null,"其 他 费 用 明 细 表"]
[]
[{"$f":"封面!A13","v":"编制单位："},null,{"$f":"封面!A15","v":"编制日期："},"单位：元"]
["      栏","费  用  项  目","预 算 数","实际数"]
["行    次"]
["     次",1,2,3]
{"$rows_left_out":22}
{"sheet":"移交生产的资产总表","index":4,"n_rows":26,"n_cols":7,"rows_kept":26,"cut":false,"hidden":false,"merged":[[0,0,0,6],[3,1,4,1],[3,2,4,2],[3,3,4,3],[3,4,4,4],[3,5,4,5],[3,6,4,6]]}
["移交生产的资产总表"]
[{"$nulls":6},"配竣建04表"]
[{"$f":"封面!A13","v":"编制单位："},null,null,{"$f":"封面!A15","v":"编制日期："},null,null,"单位：元"]
["   栏次","财产名称","建筑工程","安装工程费","设备价值","分摊费用","交付使用资产价值"]
["行次"]
[null,null,1,2,3,4,5]
{"$rows_left_out":21}
{"sheet":"移交资产—配电网资产一览表","index":5,"n_rows":117,"n_cols":11,"rows_kept":117,"cut":false,"hidden":false,"merged":[[0,0,0,10]]}
["移交资产—配电网资产一览表(线路)"]
[{"$nulls":10},"配竣建04-1表  "]
["编制单位：国网江苏省电力有限公司常州市金坛供电分公司",null,null,null,"                             编制日期：2019年4月20日",{"$nulls":5},"单位：元"]
["配电网项目编号","配电网资产名称","线路起、止地点或配变所在地","使用、保管部门","10KV线路长度（KM）","10KV电缆、架空导线型号","建筑费用","安装费用","摊入费用","交付使用资产价值","其中：附属设备价值"]
[1,2,3,4,5,6,7,8,9,"10=9+8+7",11]
[{"$f":"工作表!B3","v":"18104117A102"},{"$f":"工作表!C3","v":"常州金坛区10kV电胜线城东下塘2队东新建工程"},{"$f":"工作表!H3","v":0},"配电检修工区",{"$f":"工作表!J3","v":0.13},{"$f":"工作表!L3","v":"架空绝缘导线,AC10kV,JKLYJ,150"},{"$f":"工作表!AU3","v":0},{"$f":"工作表!AV3","v":110542.26},{"$f":"H6/(H6+'移交资产—配电网资产一览表 (2)'!H6)*工作表!AX3","v":15798.445646473285},{"$f":"SUM(G6:I6)","v":126340.70564647327}]
{"$rows_left_out":8}
{"sheet":"移交资产—配电网资产一览表 (2)","index":6,"n_rows":27,"n_cols":11,"rows_kept":27,"cut":false,"hidden":false,"merged":[[0,0,0,10],[7,7,7,8]]}
["移交资产—配电网资产一览表（设备）"]
[{"$nulls":10},"配竣建04-1表  "]
["编制单位：国网江苏省电力有限公司常州市金坛供电分公司",null,null,null,"                             编制日期：2019年4月20日",{"$nulls":5},"单位：元"]
["配电网项目编号","配电网资产名称","线路起、止地点或配变所在地","使用、保管部门","配变数量","计量单位","配变容量(型号)","设备价值","摊入费用","交付使用资产价值","其中：附属设备价值"]
[1,2,3,4,5,6,7,8,9,"10=9+8",11]
[{"$f":"工作表!B3","v":"18104117A102"},{"$f":"工作表!C3","v":"常州金坛区10kV电胜线城东下塘2队东新建工程"},{"$f":"工作表!H3","v":0},"配电检修工区",{"$f":"工作表!AR3","v":1},{"$f":"VLOOKUP(A6,Sheet2!T:V,3,0)","v":"套"},{"$f":"工作表!AS3","v":"10kV箱式变电站,630kVA,美式,硅钢片,普通,无环网柜"},{"$f":"工作表!AW3","v":117527.18},{"$f":"H6/(H6+移交资产—配电网资产一览表!H6)*工作表!AX3","v":16796.714353526717},{"$f":"SUM(H6:I6)","v":134323.8943535267}]
{"$rows_left_out":9}
{"sheet":"设备材料清册","index":7,"n_rows":3519,"n_cols":8,"rows_kept":3519,"cut":false,"hidden":false,"merged":[[0,0,0,7]]}
["设 备 材 料 清 册"]
[{"$f":"封面!A13","v":"编制单位："},null,null,{"$f":"封面!A15","v":"编制日期："}]
["配电网项目编号：",null,{"$f":"封面!E11","v":0},{"$nulls":4},"配竣建05表  "]
["配电网项目名称：",null,{"$f":"封面!E12","v":0},{"$nulls":4},"单位：元"]
["序号","设备材料名称","规格型号 ","供应单位制造厂家","计量单位","数量","单价","合价"]
[1,"10kV箱式变电站,630kVA,美式,硅钢片,普通,无环网柜",null,null,"套",1,{"$f":"H6/F6","v":117527.18},117527.18]
{"$rows_left_out":5}
{"sheet":"05(资金）","index":8,"n_rows":23,"n_cols":8,"rows_kept":23,"cut":false,"hidden":false,"merged":[[0,0,0,7],[2,0,2,6],[23,0,23,7]]}
["竣 工 工 程 财 务 决 算 表"]
[{"$nulls":7},"竣建05表"]
["编制单位：国网江苏省电力有限公司常州市金坛供电分公司                                                        2019 年 4 月 20 日",{"$nulls":6},"单位：元"]
["资金来源","行次","金  额","资金占用","行次","金  额","历年资金到位情况","金  额"]
["一、项目资本金小计",1,null,"一、移交资产合计",1,"=F7+F8+F9+F10","2016年"]
["1、",2,null,"其中: ",2,null,"2017年"]
{"$rows_left_out":18}
{"sheet":"05-1表","index":9,"n_rows":30,"n_cols":6,"rows_kept":30,"cut":false,"hidden":false,"merged":[[0,0,0,5]]}
["工程竣工决算\n应付未付款项明细表"]
[{"$nulls":5},"竣建05-1表"]
["单位名称： 国网江苏省电力有限公司常州市金坛供电分公司",null,"                             2019 年 4 月 20  日",null,null,"金额单位：元"]
["序号","合同号","债权单位","内容摘要","金额","备 注"]
[1,null,"可填","暂定未入账编审费用","可填"]
[2]
{"$rows_left_out":4}
{"sheet":"04-1","index":10,"n_rows":24,"n_cols":13,"rows_kept":24,"cut":false,"hidden":false,"merged":[[0,0,0,12]]}
["移交资产—配电网资产一览表(线路)"]
[{"$nulls":12},"配竣建04-1表  "]
["编制单位：国网江苏省电力有限公司常州市金坛供电分公司",{"$nulls":5},"                             编制日期：2019年4月20日",{"$nulls":5},"单位：元"]
["配电网项目编号","配电网资产名称","线路条数","资产类别","线路起、止地点或配变所在地","使用、保管部门","10KV线路长度（KM）","10KV电缆、架空导线型号","建筑费用","安装费用","摊入费用","交付使用资产价值","其中：附属设备价值"]
[1,2,3,4,5,6,7,8,9,10,11,"12=11+10+9",13]
["18104117A102","常州金坛区10kV电胜线城东下塘2队东新建工程",1,"中压线路",0,"配电检修工区",0.13,"架空绝缘导线,AC10kV,JKLYJ,150",0,110542.26,15798.45,126340.71]
{"$rows_left_out":5}
{"sheet":"04-2","index":11,"n_rows":32,"n_cols":12,"rows_kept":32,"cut":false,"hidden":false,"merged":[[0,0,0,11]]}
["移交资产—配电网资产一览表（设备）"]
[{"$nulls":11},"配竣建04-1表  "]
["编制单位：国网江苏省电力有限公司常州市金坛供电分公司",{"$nulls":5},"                             编制日期：2019年4月20日",{"$nulls":4},"单位：元"]
["配电网项目编号","配电网资产名称","资产类别","线路起、止地点或配变所在地","使用、保管部门","配变数量","计量单位","配变容量(型号)","设备价值","摊入费用","交付使用资产价值","其中：附属设备价值"]
[1,2,3,4,5,6,7,8,9,10,"11=10+9",12]
["18104117A102","常州金坛区10kV电胜线城东下塘2队东新建工程",160200002,0,"配电检修工区",1,"套","10kV箱式变电站,630kVA,美式,硅钢片,普通,无环网柜",117527.18,16796.71,134323.89000000001]
{"$rows_left_out":17}
{"sheet":"工作表","index":12,"n_rows":27,"n_cols":70,"rows_kept":27,"cut":false,"hidden":false,"merged":[[0,5,0,24],[0,25,0,29],[0,46,0,50],[0,0,1,0],[0,1,1,1],[0,2,1,2],[0,3,1,3],[0,4,1,4],[0,32,1,32],[0,33,1,33],[0,34,1,34],[0,35,1,35],[0,36,1,36],[0,37,1,37],[0,38,1,38],[0,39,1,39],[0,40,1,40],[0,41,1,41],[0,42,1,42],[0,43,1,43],[0,44,1,44],[0,45,1,45],[0,51,1,51],[0,52,1,52],[0,53,1,53],[0,54,1,54],[0,55,1,55],[0,56,1,56],[0,57,1,57],[0,58,1,58],[0,59,1,59],[0,60,1,60],[0,61,1,61],[0,62,1,62],[0,63,1,63],[0,64,1,64],[0,65,1,65],[0,66,1,66],[0,67,1,67],[0,68,1,68],[0,69,1,69]]}
["序号","配电网项目编号","工程名称","批准文号","概算金额","概况",{"$nulls":19},"预    算   价   值",{"$nulls":6},"施工费","监理费","设计费","利息分摊金额","管理费分摊金额","赔青费","总支出","实际较概算节约","实际较概算节约率","设备材料已入账","其中：设备费","台数","型号","其中：材料费","实际支出情况",{"$nulls":4},"配电网资产名称1","配电网资产名称2","配电网资产名称3","备注","pm系统自动生成的AM资产编号","资产号","利息","静态费用","设计费","监理费","管理费","赔偿费","待摊费用","在安装设备","建筑工程费","安装费","主材费","安装工程","预算合计"]
[{"$nulls":5},"建设地址","建设性质","线路起止地点","线路长度（KM）或配变数量","其中：10KV线路","其中：400V及以下","导线规格或配变容量","电压及回路数","混凝土杆（基）","配变台数","总容量（千伏安）","设计单位","监理单位","施工单位","预算批准机关、日期、文号","开工日期","竣工日期","预算投资","实际投资","移交生产的资产总值（元）","建筑工程","安装工程","设备价值","其他费用","合计","原施工费","施工费调整",{"$nulls":14},"建筑工程","安装工程","设备价值","其他费用","合计"]
[1,"18104117A102","常州金坛区10kV电胜线城东下塘2队东新建工程",null,{"$f":"AD3","v":263300},null,null,null,{"$f":"J3+K3","v":0.13},{"$f":"SUMIF(Sheet2!AH:AH,B3,Sheet2!AJ:AJ)","v":0.13},{"$f":"SUMIF(Sheet2!AH:AH,B3,Sheet2!AK:AK)","v":0},{"$f":"VLOOKUP(B3,Sheet2!AH:AI,2,0)","v":"架空绝缘导线,AC10kV,JKLYJ,150"},{"$nulls":8},{"$f":"VLOOKUP(B3,Sheet2!AD:AF,2,0)","v":"2018-10-15"},{"$f":"VLOOKUP(B3,Sheet2!AD:AF,3,0)","v":"2018-11-26"},{"$f":"E3","v":263300},{"$f":"AY3","v":260664.6},{"$f":"X3","v":260664.6},{"$f":"VLOOKUP(B3,Sheet2!AN:AT,3,0)","v":60326.566530130302},{"$f":"VLOOKUP(B3,Sheet2!AN:AT,4,0)","v":64292.699052204604},{"$f":"VLOOKUP(B3,Sheet2!AN:AT,5,0)","v":120983.12469},{"$f":"VLOOKUP(B3,Sheet2!AN:AT,6,0)","v":17697.609727665102},{"$f":"VLOOKUP(B3,Sheet2!AN:AT,7,0)","v":263300},{"$f":"SUMIF(Sheet2!A:A,工作表!B3,Sheet2!B:B)","v":78282.039999999994},null,{"$f":"AE3-AF3","v":78282.039999999994},{"$f":"SUMIF(Sheet2!E:E,工作表!B3,Sheet2!F:F)","v":2849.1},{"$f":"SUMIF(Sheet2!H:H,工作表!B3,Sheet2!I:I)","v":11356.79},{"$f":"SUMIF(Sheet2!K:K,工作表!B3,Sheet2!L:L)","v":109.47},{"$f":"SUMIF(Sheet2!N:N,工作表!B3,Sheet2!O:O)","v":1779.8},{"$f":"SUMIF(Sheet2!Q:Q,工作表!B3,Sheet2!R:R)","v":16500},{"$f":"AY3","v":260664.6},{"$f":"AD3-AM3","v":2635.3999999999942},{"$f":"AN3/AD3","v":1.0009115077857934E-2},{"$f":"AQ3+AT3","v":149787.4},{"$f":"SUMIF(Sheet2!T:T,工作表!B3,Sheet2!U:U)","v":117527.18},{"$f":"SUMIF(Sheet2!T:T,B3,Sheet2!W:W)","v":1},{"$f":"VLOOKUP(B3,Sheet2!T:X,5,FALSE)","v":"10kV箱式变电站,630kVA,美式,硅钢片,普通,无环网柜"},{"$f":"SUMIF(Sheet2!Z:Z,工作表!B3,Sheet2!AA:AA)","v":32260.219999999998},null,{"$f":"AT3+AG3","v":110542.26},{"$f":"AQ3","v":117527.18},{"$f":"AH3+AI3+AJ3+AK3+AL3","v":32595.16},{"$f":"AU3+AV3+AW3+AX3","v":260664.6},{"$nulls":18},{"$f":"E3","v":263300}]
[2,"18104117A105","常州金坛区10kV直溪线庄房3#变新建工程",null,{"$f":"AD4","v":217900},null,null,null,{"$f":"J4+K4","v":0.08},{"$f":"SUMIF(Sheet2!AH:AH,B4,Sheet2!AJ:AJ)","v":0.08},{"$f":"SUMIF(Sheet2!AH:AH,B4,Sheet2!AK:AK)","v":0},{"$f":"VLOOKUP(B4,Sheet2!AH:AI,2,0)","v":"架空绝缘导线,AC10kV,JKLYJ,150"},{"$nulls":8},{"$f":"VLOOKUP(B4,Sheet2!AD:AF,2,0)","v":"2018-10-08"},{"$f":"VLOOKUP(B4,Sheet2!AD:AF,3,0)","v":"2018-11-09"},{"$f":"E4","v":217900},{"$f":"AY4","v":162368.09},{"$f":"X4","v":162368.09},{"$f":"VLOOKUP(B4,Sheet2!AN:AT,3,0)","v":57163.8437012465},{"$f":"VLOOKUP(B4,Sheet2!AN:AT,4,0)","v":51660.863715948202},{"$f":"VLOOKUP(B4,Sheet2!AN:AT,5,0)","v":93352.100399999996},{"$f":"VLOOKUP(B4,Sheet2!AN:AT,6,0)","v":15723.1921828054},{"$f":"VLOOKUP(B4,Sheet2!AN:AT,7,0)","v":217900},{"$f":"SUMIF(Sheet2!A:A,工作表!B4,Sheet2!B:B)","v":43046.9},null,{"$f":"AE4-AF4","v":43046.9},{"$f":"SUMIF(Sheet2!E:E,工作表!B4,Sheet2!F:F)","v":2487.92},{"$f":"SUMIF(Sheet2!H:H,工作表!B4,Sheet2!I:I)","v":10150.379999999999},{"$f":"SUMIF(Sheet2!K:K,工作表!B4,Sheet2!L:L)","v":81.52},{"$f":"SUMIF(Sheet2!N:N,工作表!B4,Sheet2!O:O)","v":740},{"$f":"SUMIF(Sheet2!Q:Q,工作表!B4,Sheet2!R:R)","v":0},{"$f":"AY4","v":162368.09},{"$f":"AD4-AM4","v":55531.91},0.25485043597980728,{"$f":"AQ4+AT4","v":105861.37},{"$f":"SUMIF(Sheet2!T:T,工作表!B4,Sheet2!U:U)","v":88459.23},{"$f":"SUMIF(Sheet2!T:T,B4,Sheet2!W:W)","v":1},{"$f":"VLOOKUP(B4,Sheet2!T:X,5,FALSE)","v":"10kV箱式变电站,400kVA,美式,硅钢片,普通,无环网柜"},{"$f":"SUMIF(Sheet2!Z:Z,工作表!B4,Sheet2!AA:AA)","v":17402.14},null,{"$f":"AT4+AG4","v":60449.04},{"$f":"AQ4","v":88459.23},{"$f":"AH4+AI4+AJ4+AK4+AL4","v":13459.82},{"$f":"AU4+AV4+AW4+AX4","v":162368.09},{"$nulls":18},{"$f":"E4","v":217900}]
[3,"18104117A106","常州金坛区10kV白塔线白塔北商品房1#变改造工程",null,244100,null,null,null,0.249,{"$f":"SUMIF(Sheet2!AH:AH,B5,Sheet2!AJ:AJ)","v":0.159},{"$f":"SUMIF(Sheet2!AH:AH,B5,Sheet2!AK:AK)","v":0.09},{"$f":"VLOOKUP(B5,Sheet2!AH:AI,2,0)","v":"架空绝缘导线,AC10kV,JKLYJ,150"},{"$nulls":8},{"$f":"VLOOKUP(B5,Sheet2!AD:AF,2,0)","v":"2018-08-20"},{"$f":"VLOOKUP(B5,Sheet2!AD:AF,3,0)","v":"2018-10-24"},244100,276151.03999999998,276151.03999999998,{"$f":"VLOOKUP(B5,Sheet2!AN:AT,3,0)","v":55746.6504370494},{"$f":"VLOOKUP(B5,Sheet2!AN:AT,4,0)","v":72538.186906594696},{"$f":"VLOOKUP(B5,Sheet2!AN:AT,5,0)","v":95255.995379999993},{"$f":"VLOOKUP(B5,Sheet2!AN:AT,6,0)","v":20559.167276355998},{"$f":"VLOOKUP(B5,Sheet2!AN:AT,7,0)","v":244100},{"$f":"SUMIF(Sheet2!A:A,工作表!B5,Sheet2!B:B)","v":81162},null,81162,{"$f":"SUMIF(Sheet2!E:E,工作表!B5,Sheet2!F:F)","v":2931.56},{"$f":"SUMIF(Sheet2!H:H,工作表!B5,Sheet2!I:I)","v":11465.28},{"$f":"SUMIF(Sheet2!K:K,工作表!B5,Sheet2!L:L)","v":9.51},{"$f":"SUMIF(Sheet2!N:N,工作表!B5,Sheet2!O:O)","v":404.31},{"$f":"SUMIF(Sheet2!Q:Q,工作表!B5,Sheet2!R:R)","v":19500},276151.03999999998,-32051.039999999979,-0.13130290864399827,160678.38,{"$f":"SUMIF(Sheet2!T:T,工作表!B5,Sheet2!U:U)","v":88459.22},{"$f":"SUMIF(Sheet2!T:T,B5,Sheet2!W:W)","v":1},{"$f":"VLOOKUP(B5,Sheet2!T:X,5,FALSE)","v":"10kV箱式变电站,400kVA,美式,硅钢片,普通,无环网柜"},{"$f":"SUMIF(Sheet2!Z:Z,工作表!B5,Sheet2!AA:AA)","v":72219.159999999989},null,{"$f":"AT5+AG5","v":153381.15999999997},88459.22,34310.660000000003,276151.03999999998,{"$nulls":18},244100]
[4,"18104117A19F","常州金坛区南环二路（兴隆路-良湖路）新建电缆管沟工程",null,1419900,null,null,null,0,{"$f":"SUMIF(Sheet2!AH:AH,B6,Sheet2!AJ:AJ)","v":0},{"$f":"SUMIF(Sheet2!AH:AH,B6,Sheet2!AK:AK)","v":0},{"$f":"VLOOKUP(B6,Sheet2!AH:AI,2,0)","v":{"$error":"#N/A"}},{"$nulls":8},{"$f":"VLOOKUP(B6,Sheet2!AD:AF,2,0)","v":"2018-03-15"},{"$f":"VLOOKUP(B6,Sheet2!AD:AF,3,0)","v":"2018-04-11"},1419900,1582079.53,1582079.53,{"$f":"VLOOKUP(B6,Sheet2!AN:AT,3,0)","v":950892.28673490498},{"$f":"VLOOKUP(B6,Sheet2!AN:AT,4,0)","v":304857.69737027999},{"$f":"VLOOKUP(B6,Sheet2!AN:AT,5,0)","v":0},{"$f":"VLOOKUP(B6,Sheet2!AN:AT,6,0)","v":164150.015894816},{"$f":"VLOOKUP(B6,Sheet2!AN:AT,7,0)","v":1419900},{"$f":"SUMIF(Sheet2!A:A,工作表!B6,Sheet2!B:B)","v":874806.3},null,874806.3,{"$f":"SUMIF(Sheet2!E:E,工作表!B6,Sheet2!F:F)","v":28698.959999999999},{"$f":"SUMIF(Sheet2!H:H,工作表!B6,Sheet2!I:I)","v":102142.56},{"$f":"SUMIF(Sheet2!K:K,工作表!B6,Sheet2!L:L)","v":68.55},{"$f":"SUMIF(Sheet2!N:N,工作表!B6,Sheet2!O:O)","v":5266.08},{"$f":"SUMIF(Sheet2!Q:Q,工作表!B6,Sheet2!R:R)","v":42500},1582079.53,-162179.53000000003,-0.11421898020987395,528597.08000000007,{"$f":"SUMIF(Sheet2!T:T,工作表!B6,Sheet2!U:U)","v":0},{"$f":"SUMIF(Sheet2!T:T,B6,Sheet2!W:W)","v":0},{"$f":"VLOOKUP(B6,Sheet2!T:X,5,FALSE)","v":{"$error":"#N/A"}},{"$f":"SUMIF(Sheet2!Z:Z,工作表!B6,Sheet2!AA:AA)","v":528597.08000000007},{"$f":"AT6+AG6","v":1403403.3800000001},null,0,178676.15,1582079.53,{"$nulls":18},1419900]
{"$rows_left_out":22}
{"sheet":"Sheet2","index":13,"n_rows":864,"n_cols":57,"rows_kept":864,"cut":false,"hidden":false,"merged":[]}
["项目定义编码","行项目金额","施工费","监理费","项目定义编码","行项目金额","设计费","项目定义编码","行项目金额","建设期贷款利息","项目定义编码","行项目金额","管理费","项目定义编码","行项目金额","线路施工赔偿费","项目定义编码","行项目金额","设备费","项目定义编码","行项目金额","单位","台数","物料描述","材料费","项目定义编码","行项目金额","线路长度（KM）或配变数量","开竣工时间","工程编号","开工时间","竣工时间","电缆","项目定义编码","项目定义描述","10kV","低压",null,"预算拆分","项目定义","项目名称","建筑工程费","安装工程费","设备购置费","其它费用","工程总造价",null,null,null,"项目定义","项目名称","项目估算（万元）","发文批次"]
["18104117A1A3",418551.71,null,null,"18104117A1A3",29184.720000000001,null,"18104117A106",11465.28,null,"18104117A105",8.42,null,"18104117A105",740,null,"18104117A1A3",43689.32,null,"18104117A102",117527.18,"套",1,"10kV箱式变电站,630kVA,美式,硅钢片,普通,无环网柜",null,"18104117A1A3",373027.94,null,null,"18104117A102","2018-10-15","2018-11-26",null,"18104117A106","架空绝缘导线,AC10kV,JKLYJ,150",8.9999999999999993E-3,null,null,null,"18104117A102","常州金坛区10kV电胜线城东下塘2队东新建工程",60326.566530130302,64292.699052204604,120983.12469,17697.609727665102,263300]
["18104117A19F",482324.77,null,null,"18104117A19F",28698.959999999999,null,"18104117A102",11356.79,null,"18104117A19F",1.88,null,"18104117A102",900,null,"18104117A1A3",49000,null,"18104117A105",88459.23,"套",1,"10kV箱式变电站,400kVA,美式,硅钢片,普通,无环网柜",null,"18104117A106",35.64,null,null,"18104117A105","2018-10-08","2018-11-09",null,"18104117A106","电力电缆,AC10kV,YJV,70,3,22,ZC,无阻水",0.15,null,null,null,"18104117A105","常州金坛区10kV直溪线庄房3#变新建工程",57163.8437012465,51660.863715948202,93352.100399999996,15723.1921828054,217900]
["18104117A1A3",0.01,null,null,"18104117A106",2931.56,null,"18104117A1A3",39490.870000000003,null,"18104117A1A3",39.26,null,"18104117A1D8",20.77,null,"18104117A1A3",153800,null,"18104117A106",88459.22,"套",1,"10kV箱式变电站,400kVA,美式,硅钢片,普通,无环网柜",null,"18104117A106",35.64,null,null,"18104117A106","2018-08-20","2018-10-24",null,"18104117A102","架空绝缘导线,AC10kV,JKLYJ,150",1.4999999999999999E-2,null,null,null,"18104117A106","常州金坛区10kV白塔线白塔北商品房1#变改造工程",55746.6504370494,72538.186906594696,95255.995379999993,20559.167276355998,244100]
["18104117A1DE",11950.11,null,null,"18104117A102",2849.1,null,"18104117A19F",19751.29,null,"18104117A102",12.27,null,"18104117A1DB",28.7,null,"18104117A19F",42500,null,"18104117A1D6",33316.339999999997,"台",1,"10kV变压器,400kVA,普通,非晶合金,油浸",null,"18104117A106",254.55,null,null,"18104117A19F","2018-03-15","2018-04-11",null,"18104117A102","电力电缆,AC10kV,YJV,70,3,22,ZC,无阻水",0.115,null,null,null,"18104117A19F","常州金坛区南环二路（兴隆路-良湖路）新建电缆管沟工程",950892.28673490498,304857.69737027999,0,164150.015894816,1419900]
["18104117A1DA",20179.509999999998,null,null,"18104117A105",2487.92,null,"18104117A105",10150.379999999999,null,"18104117A106",9.51,null,"18104117A1D5",313.51,null,"18104117A106",19500,null,"18104117A1DF",134500,"套",1,"10kV箱式变电站,500kVA,欧式,硅钢片,普通,有环网柜",null,"18104117A106",75.58,null,null,"18104117A1A3","2017-09-10","2017-11-11",null,"18104117A1D9","架空绝缘导线,AC10kV,JKLYJ,150",1.7999999999999999E-2,null,null,null,"18104117A1A3","常州金坛区S239省道北侧新建电缆管沟工程",840024.34662098705,436976.01908122102,0,166799.63429779201,1443800]
{"$rows_left_out":534}
{"sheet":"移交资产—配电网资产一览表（OLD）","index":14,"n_rows":194,"n_cols":14,"rows_kept":194,"cut":false,"hidden":true,"merged":[[0,0,0,13]]}
["移交资产—配电网资产一览表"]
[{"$nulls":13},"配竣建04-1表  "]
[{"$f":"封面!A13","v":"编制单位："},{"$nulls":4},{"$f":"封面!A15","v":"编制日期："},{"$nulls":7},"单位：元"]
["配电网项目编号","配电网资产名称","线路起、止地点或配变所在地","使用、保管部门","计量单位","线路长度（KM）","配变数量","导线规格或配变容量(型号)","建筑费用","安装费用","设备价值","摊入费用","交付使用资产价值","其中：附属设备价值"]
[1,2,3,4,5,6,null,7,8,9,10,11,"12=8+9+10+11",13]
[{"$f":"工作表!B3","v":"18104117A102"},{"$f":"工作表!C3","v":"常州金坛区10kV电胜线城东下塘2队东新建工程"},{"$f":"工作表!H3","v":0},"配电检修工区",{"$f":"Sheet2!V2","v":"套"},{"$f":"工作表!I3","v":0.13},{"$f":"工作表!AR3","v":1},{"$f":"工作表!L3","v":"架空绝缘导线,AC10kV,JKLYJ,150"},{"$f":"工作表!AU3","v":0},{"$f":"工作表!AV3","v":110542.26},{"$f":"工作表!AW3","v":117527.18},{"$f":"工作表!AX3","v":32595.16},{"$f":"SUM(I6:L6)","v":260664.6}]
{"$rows_left_out":45}
{"sheet":"45个项目开竣工时间","index":15,"n_rows":47,"n_cols":6,"rows_kept":47,"cut":false,"hidden":true,"merged":[]}
["序号","工程编号","工程名称","实施部门","工程开工时间","工程结束时间"]
[1,"18104015A686","常州本部10kV天泰线遥观剑湖金纯耿北新建配变工程","输配电公司","2016-02-25","2016-03-11"]
[2,"18104015A68B","常州本部10kV运河线遥观村2#东新建配变工程","输配电公司","2016-03-30","2016-04-15"]
[3,"18104015A682","常州本部10kV杨区线遥观张家村灯总2#新建配变工程","输配电公司","2016-03-15","2016-03-30"]
[4,"18104015A6C5","常州本部10kV恒耐线遥观勤剑新村2#新建配变工程","输配电公司","2016-07-15","2016-08-02"]
[5,"18104015A685","常州本部10kV渔庄线遥观东方村东马庄2#新建配变工程","输配电公司","2016-04-01","2016-04-15"]
{"$rows_left_out":42}
{"sheet":"项目明细账","index":16,"n_rows":490,"n_cols":23,"rows_kept":490,"cut":false,"hidden":false,"merged":[]}
["过账日期","凭证编码","归档凭证类型","归档凭证编码","凭证抬头文本","WBS编码","WBS描述","项目定义编码","项目定义描述","科目代码","科目名称","借贷方向","行项目金额","数量","物料编码","物料描述","单位","进项税"]
["2017-06-07","4900112478","发货","22","对常州金坛区10kV直溪线庄房3#变新建工发货","18104117A10200A1310Z0001","箱式变","18104117A102","常州金坛区10kV电胜线城东下塘2队东新建工程","9201030000","工程成本-在安装设备","借",117527.18,1,"500001083","10kV箱式变电站,630kVA,美式,硅钢片,普通,无环网柜","套",19979.62,0,"",null,"",""]
["2017-06-07","4900112478","发货","22","对常州金坛区10kV直溪线庄房3#变新建工发货","18104117A10500A1310Z0001","箱式变","18104117A105","常州金坛区10kV直溪线庄房3#变新建工程","9201030000","工程成本-在安装设备","借",88459.23,1,"500001040","10kV箱式变电站,400kVA,美式,硅钢片,普通,无环网柜","套",15038.07,0,"",null,"",""]
["2017-06-07","4900112478","发货","22","对常州金坛区10kV直溪线庄房3#变新建工发货","18104117A10600A1310Z0001","箱式变","18104117A106","常州金坛区10kV白塔线白塔北商品房1#变改造工程","9201030000","工程成本-在安装设备","借",88459.22,1,"500001040","10kV箱式变电站,400kVA,美式,硅钢片,普通,无环网柜","套",15038.07,0,"",null,"",""]
["2017-06-15","4900130058","发货","60","对常州金坛区10kV愚池线愚池小区54幢楼发货","18104117A1A300A1370Z0001","中压电缆线路","18104117A1A3","常州金坛区S239省道北侧新建电缆管沟工程","9201030000","工程成本-在安装设备","借",373027.94,4545,"500021520","电缆保护管,MPP,φ200","米",63414.75,0,"",null,"",""]
["2017-06-15","5000068823","转账","217","常州金坛区10kV白塔线白塔北商品房1#确认服务费","18104117A10600A5320000","工程设计费","18104117A106","常州金坛区10kV白塔线白塔北商品房1#变改造工程","9201050000","工程成本-待摊支出-其他","借",11465.28,12153.2,"","","作业单位",687.92,0,"",null,"1000125010","常州金坛天源电力设计有限公司"]
{"$rows_left_out":484}